{"text_format":"1","workbook":"xlsx","n_sheets":5,"sheets":["Employés","Planning mensuel congés","Synthèse congés annuel","Listes","Instructions"],"not_rendered":{"charts":0,"images":2,"macros":1,"external_links":0,"defined_names":0,"comments":0,"pivot_tables":0},"unopened":[],"bounds":{"document_bytes":16777216,"sheet_cells":100000,"rows_first":2000,"rows_last":500,"rows_between":2000,"halvings":0,"cell_chars":16384,"cell_head_chars":4096},"cells_cut":0,"cells_raw":0,"read":"whole","date_system":"1900"}

{"sheet":"Employés","index":0,"n_rows":5,"n_cols":5,"rows_kept":5,"cut":false,"hidden":false,"merged":[[0,2,2,5]]}
[null,null,"Listes des employés"]
[]
[]
[]
[null,null,null,null,"Liste employés"]

{"sheet":"Planning mensuel congés","index":1,"n_rows":163,"n_cols":32,"rows_kept":163,"cut":false,"hidden":false,"merged":[[0,1,2,8]]}
[null,"Planning mensuel congés"]
[]
[]
[null,null,null,"Service:","Nom Service"]
[null,null,null,"Année:","Année"]
[null,"Légende",null,null,null,null,null,null,"Autres  (maternité, …)","AUTRES"]
[null,"Week-end",null,"Congé","C. ou C./2","Congé sans solde","S.S.",null,"Absences autorisées","ABS.  AUT."]
[null,"Jour férié",null,"RTT","RTT","Maladie","MAL.",null,"Absences non autorisées","ABS. NON AUT."]
["Janvier","Nombre de jours",{"$f":"IF(OR($E$5=\"\", $E$5=\"Année\",A9=\"\"),\"Entrer année ou vérifier mois\",DAY(DATE(E5,MONTH(A9&\"1\")+1,1)-1))","v":"Entrer année ou vérifier mois"}]
["Employés",{"$f":"IF(OR($E$5=\"\",$E$5=\"Année\",A9=\"\"),\"\",DAY(DATE($E$5,MONTH(A9&\"1\")+1,1)-1)-DAY(DATE($E$5,MONTH(A9&\"1\")+1,1)-1)+1)","v":""},{"$f":"_xlfn.IFS(B10=\"\",\"\",B10<$C9,B10+1,B10=$C9,\"\")","v":""},{"$f":"_xlfn.IFS(C10=\"\",\"\",C10<$C9,C10+1,C10=$C9,\"\")","v":""},{"$f":"_xlfn.IFS(D10=\"\",\"\",D10<$C9,D10+1,D10=$C9,\"\")","v":""},{"$f":"_xlfn.IFS(E10=\"\",\"\",E10<$C9,E10+1,E10=$C9,\"\")","v":""},{"$f":"_xlfn.IFS(F10=\"\",\"\",F10<$C9,F10+1,F10=$C9,\"\")","v":""},{"$f":"_xlfn.IFS(G10=\"\",\"\",G10<$C9,G10+1,G10=$C9,\"\")","v":""},{"$f":"_xlfn.IFS(H10=\"\",\"\",H10<$C9,H10+1,H10=$C9,\"\")","v":""},{"$f":"_xlfn.IFS(I10=\"\",\"\",I10<$C9,I10+1,I10=$C9,\"\")","v":""},{"$f":"_xlfn.IFS(J10=\"\",\"\",J10<$C9,J10+1,J10=$C9,\"\")","v":""},{"$f":"_xlfn.IFS(K10=\"\",\"\",K10<$C9,K10+1,K10=$C9,\"\")","v":""},{"$f":"_xlfn.IFS(L10=\"\",\"\",L10<$C9,L10+1,L10=$C9,\"\")","v":""},{"$f":"_xlfn.IFS(M10=\"\",\"\",M10<$C9,M10+1,M10=$C9,\"\")","v":""},{"$f":"_xlfn.IFS(N10=\"\",\"\",N10<$C9,N10+1,N10=$C9,\"\")","v":""},{"$f":"_xlfn.IFS(O10=\"\",\"\",O10<$C9,O10+1,O10=$C9,\"\")","v":""},{"$f":"_xlfn.IFS(P10=\"\",\"\",P10<$C9,P10+1,P10=$C9,\"\")","v":""},{"$f":"_xlfn.IFS(Q10=\"\",\"\",Q10<$C9,Q10+1,Q10=$C9,\"\")","v":""},{"$f":"_xlfn.IFS(R10=\"\",\"\",R10<$C9,R10+1,R10=$C9,\"\")","v":""},{"$f":"_xlfn.IFS(S10=\"\",\"\",S10<$C9,S10+1,S10=$C9,\"\")","v":""},{"$f":"_xlfn.IFS(T10=\"\",\"\",T10<$C9,T10+1,T10=$C9,\"\")","v":""},{"$f":"_xlfn.IFS(U10=\"\",\"\",U10<$C9,U10+1,U10=$C9,\"\")","v":""},{"$f":"_xlfn.IFS(V10=\"\",\"\",V10<$C9,V10+1,V10=$C9,\"\")","v":""},{"$f":"_xlfn.IFS(W10=\"\",\"\",W10<$C9,W10+1,W10=$C9,\"\")","v":""},{"$f":"_xlfn.IFS(X10=\"\",\"\",X10<$C9,X10+1,X10=$C9,\"\")","v":""},{"$f":"_xlfn.IFS(Y10=\"\",\"\",Y10<$C9,Y10+1,Y10=$C9,\"\")","v":""},{"$f":"_xlfn.IFS(Z10=\"\",\"\",Z10<$C9,Z10+1,Z10=$C9,\"\")","v":""},{"$f":"_xlfn.IFS(AA10=\"\",\"\",AA10<$C9,AA10+1,AA10=$C9,\"\")","v":""},{"$f":"_xlfn.IFS(AB10=\"\",\"\",AB10<$C9,AB10+1,AB10=$C9,\"\")","v":""},{"$f":"_xlfn.IFS(AC10=\"\",\"\",AC10<$C9,AC10+1,AC10=$C9,\"\")","v":""},{"$f":"_xlfn.IFS(AD10=\"\",\"\",AD10<$C9,AD10+1,AD10=$C9,\"\")","v":""},{"$f":"_xlfn.IFS(AE10=\"\",\"\",AE10<$C9,AE10+1,AE10=$C9,\"\")","v":""}]
[{"$f":" IF(Employés!$E$6=\"\",\"\",Employés!$E$6)","v":""}]
[{"$f":" IF(Employés!$E$7=\"\",\"\",Employés!$E$7)","v":""}]
[{"$f":" IF(Employés!$E$8=\"\",\"\",Employés!$E$8)","v":""}]
[{"$f":" IF(Employés!$E$9=\"\",\"\",Employés!$E$9)","v":""}]
[{"$f":" IF(Employés!$E$10=\"\",\"\",Employés!$E$10)","v":""}]
[{"$f":" IF(Employés!$E$11=\"\",\"\",Employés!$E$11)","v":""}]
[{"$f":" IF(Employés!$E$12=\"\",\"\",Employés!$E$12)","v":""}]
[{"$f":" IF(Employés!$E$13=\"\",\"\",Employés!$E$13)","v":""}]
[{"$f":" IF(Employés!$E$14=\"\",\"\",Employés!$E$14)","v":""}]
[{"$f":" IF(Employés!$E$15=\"\",\"\",Employés!$E$15)","v":""}]
{"$rows_left_out":144}
{"sheet":"Synthèse congés annuel","index":2,"n_rows":18,"n_cols":8,"rows_kept":18,"cut":false,"hidden":false,"merged":[[0,2,1,7],[3,3,3,6],[4,3,4,6]]}
[null,null,"Synthèse annuelle congés  "]
[]
[]
[null,null,"Service:",{"$f":"'Planning mensuel congés'!$E$4","v":"Nom Service"}]
[null,null,"Année:",{"$f":"'Planning mensuel congés'!$E$5","v":"Année"}]
[]
["Employés","Nombre de jours de congés posés","Nombre de jours de RTT posés","Nombre de jours d'absence autorisée","Nombre de jours de congés sans solde posés","Nombre de jours de maladie","Nombre de jours d'Absence non autorisée","Nombre de jours de \"Autre\" posés"]
[{"$f":" IF(Employés!$E$6=\"\",\"\",Employés!$E$6)","v":""},{"$f":"SUMPRODUCT(('Planning mensuel congés'!$A$9:$A$10000=$A8)*('Planning mensuel congés'!$B$9:$AF$10000=Listes!$G$9)+('Planning mensuel congés'!$A$9:$A$10000=$A8)*(('Planning mensuel congés'!$B$9:$AF$10000=Listes!$G$9))/2)","v":0},{"$f":"SUMPRODUCT(('Planning mensuel congés'!$A$9:$A$10000=$A8)*('Planning mensuel congés'!$B$9:$AF$10000=Listes!$G$13)+('Planning mensuel congés'!$A$9:$A$10000=$A8)*(('Planning mensuel congés'!$B$9:$AF$10000=Listes!$G$14))/2)","v":0},{"$f":"SUMPRODUCT(('Planning mensuel congés'!$A$9:$A$10000=$A8)*('Planning mensuel congés'!$B$9:$AF$10000=Listes!$G$8)+('Planning mensuel congés'!$A$9:$A$10000=$A8)*(('Planning mensuel congés'!$B$9:$AF$10000=Listes!$G$17))/2)","v":0},{"$f":"SUMPRODUCT(('Planning mensuel congés'!$A$9:$A$10000=$A8)*('Planning mensuel congés'!$B$9:$AF$10000=Listes!$G$12)+('Planning mensuel congés'!$A$9:$A$10000=$A8)*(('Planning mensuel congés'!$B$9:$AF$10000=Listes!$G$18))/2)","v":0},{"$f":"SUMPRODUCT(('Planning mensuel congés'!$A$9:$A$10000=$A8)*('Planning mensuel congés'!$B$9:$AF$10000=Listes!$G$11)+('Planning mensuel congés'!$A$9:$A$10000=$A8)*(('Planning mensuel congés'!$B$9:$AF$10000=Listes!$G$19))/2)","v":0},{"$f":"SUMPRODUCT(('Planning mensuel congés'!$A$9:$A$10000=$A8)*('Planning mensuel congés'!$B$9:$AF$10000=Listes!$G$7)+('Planning mensuel congés'!$A$9:$A$10000=$A8)*(('Planning mensuel congés'!$B$9:$AF$10000=Listes!$G$16))/2)","v":0},{"$f":"SUMPRODUCT(('Planning mensuel congés'!$A$9:$A$10000=$A8)*('Planning mensuel congés'!$B$9:$AF$10000=Listes!$G$6)+('Planning mensuel congés'!$A$9:$A$10000=$A8)*(('Planning mensuel congés'!$B$9:$AF$10000=Listes!$G$15))/2)","v":0}]
[{"$f":" IF(Employés!$E$7=\"\",\"\",Employés!$E$7)","v":""},{"$f":"SUMPRODUCT(('Planning mensuel congés'!$A$9:$A$10000=$A9)*('Planning mensuel congés'!$B$9:$AF$10000=Listes!$G$9)+('Planning mensuel congés'!$A$9:$A$10000=$A9)*(('Planning mensuel congés'!$B$9:$AF$10000=Listes!$G$9))/2)","v":0},{"$f":"SUMPRODUCT(('Planning mensuel congés'!$A$9:$A$10000=$A9)*('Planning mensuel congés'!$B$9:$AF$10000=Listes!$G$13)+('Planning mensuel congés'!$A$9:$A$10000=$A9)*(('Planning mensuel congés'!$B$9:$AF$10000=Listes!$G$14))/2)","v":0},{"$f":"SUMPRODUCT(('Planning mensuel congés'!$A$9:$A$10000=$A9)*('Planning mensuel congés'!$B$9:$AF$10000=Listes!$G$8)+('Planning mensuel congés'!$A$9:$A$10000=$A9)*(('Planning mensuel congés'!$B$9:$AF$10000=Listes!$G$17))/2)","v":0},{"$f":"SUMPRODUCT(('Planning mensuel congés'!$A$9:$A$10000=$A9)*('Planning mensuel congés'!$B$9:$AF$10000=Listes!$G$12)+('Planning mensuel congés'!$A$9:$A$10000=$A9)*(('Planning mensuel congés'!$B$9:$AF$10000=Listes!$G$18))/2)","v":0},{"$f":"SUMPRODUCT(('Planning mensuel congés'!$A$9:$A$10000=$A9)*('Planning mensuel congés'!$B$9:$AF$10000=Listes!$G$11)+('Planning mensuel congés'!$A$9:$A$10000=$A9)*(('Planning mensuel congés'!$B$9:$AF$10000=Listes!$G$19))/2)","v":0},{"$f":"SUMPRODUCT(('Planning mensuel congés'!$A$9:$A$10000=$A9)*('Planning mensuel congés'!$B$9:$AF$10000=Listes!$G$7)+('Planning mensuel congés'!$A$9:$A$10000=$A9)*(('Planning mensuel congés'!$B$9:$AF$10000=Listes!$G$16))/2)","v":0},{"$f":"SUMPRODUCT(('Planning mensuel congés'!$A$9:$A$10000=$A9)*('Planning mensuel congés'!$B$9:$AF$10000=Listes!$G$6)+('Planning mensuel congés'!$A$9:$A$10000=$A9)*(('Planning mensuel congés'!$B$9:$AF$10000=Listes!$G$15))/2)","v":0}]
[{"$f":" IF(Employés!$E$8=\"\",\"\",Employés!$E$8)","v":""},{"$f":"SUMPRODUCT(('Planning mensuel congés'!$A$9:$A$10000=$A10)*('Planning mensuel congés'!$B$9:$AF$10000=Listes!$G$9)+('Planning mensuel congés'!$A$9:$A$10000=$A10)*(('Planning mensuel congés'!$B$9:$AF$10000=Listes!$G$9))/2)","v":0},{"$f":"SUMPRODUCT(('Planning mensuel congés'!$A$9:$A$10000=$A10)*('Planning mensuel congés'!$B$9:$AF$10000=Listes!$G$13)+('Planning mensuel congés'!$A$9:$A$10000=$A10)*(('Planning mensuel congés'!$B$9:$AF$10000=Listes!$G$14))/2)","v":0},{"$f":"SUMPRODUCT(('Planning mensuel congés'!$A$9:$A$10000=$A10)*('Planning mensuel congés'!$B$9:$AF$10000=Listes!$G$8)+('Planning mensuel congés'!$A$9:$A$10000=$A10)*(('Planning mensuel congés'!$B$9:$AF$10000=Listes!$G$17))/2)","v":0},{"$f":"SUMPRODUCT(('Planning mensuel congés'!$A$9:$A$10000=$A10)*('Planning mensuel congés'!$B$9:$AF$10000=Listes!$G$12)+('Planning mensuel congés'!$A$9:$A$10000=$A10)*(('Planning mensuel congés'!$B$9:$AF$10000=Listes!$G$18))/2)","v":0},{"$f":"SUMPRODUCT(('Planning mensuel congés'!$A$9:$A$10000=$A10)*('Planning mensuel congés'!$B$9:$AF$10000=Listes!$G$11)+('Planning mensuel congés'!$A$9:$A$10000=$A10)*(('Planning mensuel congés'!$B$9:$AF$10000=Listes!$G$19))/2)","v":0},{"$f":"SUMPRODUCT(('Planning mensuel congés'!$A$9:$A$10000=$A10)*('Planning mensuel congés'!$B$9:$AF$10000=Listes!$G$7)+('Planning mensuel congés'!$A$9:$A$10000=$A10)*(('Planning mensuel congés'!$B$9:$AF$10000=Listes!$G$16))/2)","v":0},{"$f":"SUMPRODUCT(('Planning mensuel congés'!$A$9:$A$10000=$A10)*('Planning mensuel congés'!$B$9:$AF$10000=Listes!$G$6)+('Planning mensuel congés'!$A$9:$A$10000=$A10)*(('Planning mensuel congés'!$B$9:$AF$10000=Listes!$G$15))/2)","v":0}]
[{"$f":" IF(Employés!$E$9=\"\",\"\",Employés!$E$9)","v":""},{"$f":"SUMPRODUCT(('Planning mensuel congés'!$A$9:$A$10000=$A11)*('Planning mensuel congés'!$B$9:$AF$10000=Listes!$G$9)+('Planning mensuel congés'!$A$9:$A$10000=$A11)*(('Planning mensuel congés'!$B$9:$AF$10000=Listes!$G$9))/2)","v":0},{"$f":"SUMPRODUCT(('Planning mensuel congés'!$A$9:$A$10000=$A11)*('Planning mensuel congés'!$B$9:$AF$10000=Listes!$G$13)+('Planning mensuel congés'!$A$9:$A$10000=$A11)*(('Planning mensuel congés'!$B$9:$AF$10000=Listes!$G$14))/2)","v":0},{"$f":"SUMPRODUCT(('Planning mensuel congés'!$A$9:$A$10000=$A11)*('Planning mensuel congés'!$B$9:$AF$10000=Listes!$G$8)+('Planning mensuel congés'!$A$9:$A$10000=$A11)*(('Planning mensuel congés'!$B$9:$AF$10000=Listes!$G$17))/2)","v":0},{"$f":"SUMPRODUCT(('Planning mensuel congés'!$A$9:$A$10000=$A11)*('Planning mensuel congés'!$B$9:$AF$10000=Listes!$G$12)+('Planning mensuel congés'!$A$9:$A$10000=$A11)*(('Planning mensuel congés'!$B$9:$AF$10000=Listes!$G$18))/2)","v":0},{"$f":"SUMPRODUCT(('Planning mensuel congés'!$A$9:$A$10000=$A11)*('Planning mensuel congés'!$B$9:$AF$10000=Listes!$G$11)+('Planning mensuel congés'!$A$9:$A$10000=$A11)*(('Planning mensuel congés'!$B$9:$AF$10000=Listes!$G$19))/2)","v":0},{"$f":"SUMPRODUCT(('Planning mensuel congés'!$A$9:$A$10000=$A11)*('Planning mensuel congés'!$B$9:$AF$10000=Listes!$G$7)+('Planning mensuel congés'!$A$9:$A$10000=$A11)*(('Planning mensuel congés'!$B$9:$AF$10000=Listes!$G$16))/2)","v":0},{"$f":"SUMPRODUCT(('Planning mensuel congés'!$A$9:$A$10000=$A11)*('Planning mensuel congés'!$B$9:$AF$10000=Listes!$G$6)+('Planning mensuel congés'!$A$9:$A$10000=$A11)*(('Planning mensuel congés'!$B$9:$AF$10000=Listes!$G$15))/2)","v":0}]
[{"$f":" IF(Employés!$E$10=\"\",\"\",Employés!$E$10)","v":""},{"$f":"SUMPRODUCT(('Planning mensuel congés'!$A$9:$A$10000=$A12)*('Planning mensuel congés'!$B$9:$AF$10000=Listes!$G$9)+('Planning mensuel congés'!$A$9:$A$10000=$A12)*(('Planning mensuel congés'!$B$9:$AF$10000=Listes!$G$9))/2)","v":0},{"$f":"SUMPRODUCT(('Planning mensuel congés'!$A$9:$A$10000=$A12)*('Planning mensuel congés'!$B$9:$AF$10000=Listes!$G$13)+('Planning mensuel congés'!$A$9:$A$10000=$A12)*(('Planning mensuel congés'!$B$9:$AF$10000=Listes!$G$14))/2)","v":0},{"$f":"SUMPRODUCT(('Planning mensuel congés'!$A$9:$A$10000=$A12)*('Planning mensuel congés'!$B$9:$AF$10000=Listes!$G$8)+('Planning mensuel congés'!$A$9:$A$10000=$A12)*(('Planning mensuel congés'!$B$9:$AF$10000=Listes!$G$17))/2)","v":0},{"$f":"SUMPRODUCT(('Planning mensuel congés'!$A$9:$A$10000=$A12)*('Planning mensuel congés'!$B$9:$AF$10000=Listes!$G$12)+('Planning mensuel congés'!$A$9:$A$10000=$A12)*(('Planning mensuel congés'!$B$9:$AF$10000=Listes!$G$18))/2)","v":0},{"$f":"SUMPRODUCT(('Planning mensuel congés'!$A$9:$A$10000=$A12)*('Planning mensuel congés'!$B$9:$AF$10000=Listes!$G$11)+('Planning mensuel congés'!$A$9:$A$10000=$A12)*(('Planning mensuel congés'!$B$9:$AF$10000=Listes!$G$19))/2)","v":0},{"$f":"SUMPRODUCT(('Planning mensuel congés'!$A$9:$A$10000=$A12)*('Planning mensuel congés'!$B$9:$AF$10000=Listes!$G$7)+('Planning mensuel congés'!$A$9:$A$10000=$A12)*(('Planning mensuel congés'!$B$9:$AF$10000=Listes!$G$16))/2)","v":0},{"$f":"SUMPRODUCT(('Planning mensuel congés'!$A$9:$A$10000=$A12)*('Planning mensuel congés'!$B$9:$AF$10000=Listes!$G$6)+('Planning mensuel congés'!$A$9:$A$10000=$A12)*(('Planning mensuel congés'!$B$9:$AF$10000=Listes!$G$15))/2)","v":0}]
[{"$f":" IF(Employés!$E$11=\"\",\"\",Employés!$E$11)","v":""},{"$f":"SUMPRODUCT(('Planning mensuel congés'!$A$9:$A$10000=$A13)*('Planning mensuel congés'!$B$9:$AF$10000=Listes!$G$9)+('Planning mensuel congés'!$A$9:$A$10000=$A13)*(('Planning mensuel congés'!$B$9:$AF$10000=Listes!$G$9))/2)","v":0},{"$f":"SUMPRODUCT(('Planning mensuel congés'!$A$9:$A$10000=$A13)*('Planning mensuel congés'!$B$9:$AF$10000=Listes!$G$13)+('Planning mensuel congés'!$A$9:$A$10000=$A13)*(('Planning mensuel congés'!$B$9:$AF$10000=Listes!$G$14))/2)","v":0},{"$f":"SUMPRODUCT(('Planning mensuel congés'!$A$9:$A$10000=$A13)*('Planning mensuel congés'!$B$9:$AF$10000=Listes!$G$8)+('Planning mensuel congés'!$A$9:$A$10000=$A13)*(('Planning mensuel congés'!$B$9:$AF$10000=Listes!$G$17))/2)","v":0},{"$f":"SUMPRODUCT(('Planning mensuel congés'!$A$9:$A$10000=$A13)*('Planning mensuel congés'!$B$9:$AF$10000=Listes!$G$12)+('Planning mensuel congés'!$A$9:$A$10000=$A13)*(('Planning mensuel congés'!$B$9:$AF$10000=Listes!$G$18))/2)","v":0},{"$f":"SUMPRODUCT(('Planning mensuel congés'!$A$9:$A$10000=$A13)*('Planning mensuel congés'!$B$9:$AF$10000=Listes!$G$11)+('Planning mensuel congés'!$A$9:$A$10000=$A13)*(('Planning mensuel congés'!$B$9:$AF$10000=Listes!$G$19))/2)","v":0},{"$f":"SUMPRODUCT(('Planning mensuel congés'!$A$9:$A$10000=$A13)*('Planning mensuel congés'!$B$9:$AF$10000=Listes!$G$7)+('Planning mensuel congés'!$A$9:$A$10000=$A13)*(('Planning mensuel congés'!$B$9:$AF$10000=Listes!$G$16))/2)","v":0},{"$f":"SUMPRODUCT(('Planning mensuel congés'!$A$9:$A$10000=$A13)*('Planning mensuel congés'!$B$9:$AF$10000=Listes!$G$6)+('Planning mensuel congés'!$A$9:$A$10000=$A13)*(('Planning mensuel congés'!$B$9:$AF$10000=Listes!$G$15))/2)","v":0}]
[{"$f":" IF(Employés!$E$12=\"\",\"\",Employés!$E$12)","v":""},{"$f":"SUMPRODUCT(('Planning mensuel congés'!$A$9:$A$10000=$A14)*('Planning mensuel congés'!$B$9:$AF$10000=Listes!$G$9)+('Planning mensuel congés'!$A$9:$A$10000=$A14)*(('Planning mensuel congés'!$B$9:$AF$10000=Listes!$G$9))/2)","v":0},{"$f":"SUMPRODUCT(('Planning mensuel congés'!$A$9:$A$10000=$A14)*('Planning mensuel congés'!$B$9:$AF$10000=Listes!$G$13)+('Planning mensuel congés'!$A$9:$A$10000=$A14)*(('Planning mensuel congés'!$B$9:$AF$10000=Listes!$G$14))/2)","v":0},{"$f":"SUMPRODUCT(('Planning mensuel congés'!$A$9:$A$10000=$A14)*('Planning mensuel congés'!$B$9:$AF$10000=Listes!$G$8)+('Planning mensuel congés'!$A$9:$A$10000=$A14)*(('Planning mensuel congés'!$B$9:$AF$10000=Listes!$G$17))/2)","v":0},{"$f":"SUMPRODUCT(('Planning mensuel congés'!$A$9:$A$10000=$A14)*('Planning mensuel congés'!$B$9:$AF$10000=Listes!$G$12)+('Planning mensuel congés'!$A$9:$A$10000=$A14)*(('Planning mensuel congés'!$B$9:$AF$10000=Listes!$G$18))/2)","v":0},{"$f":"SUMPRODUCT(('Planning mensuel congés'!$A$9:$A$10000=$A14)*('Planning mensuel congés'!$B$9:$AF$10000=Listes!$G$11)+('Planning mensuel congés'!$A$9:$A$10000=$A14)*(('Planning mensuel congés'!$B$9:$AF$10000=Listes!$G$19))/2)","v":0},{"$f":"SUMPRODUCT(('Planning mensuel congés'!$A$9:$A$10000=$A14)*('Planning mensuel congés'!$B$9:$AF$10000=Listes!$G$7)+('Planning mensuel congés'!$A$9:$A$10000=$A14)*(('Planning mensuel congés'!$B$9:$AF$10000=Listes!$G$16))/2)","v":0},{"$f":"SUMPRODUCT(('Planning mensuel congés'!$A$9:$A$10000=$A14)*('Planning mensuel congés'!$B$9:$AF$10000=Listes!$G$6)+('Planning mensuel congés'!$A$9:$A$10000=$A14)*(('Planning mensuel congés'!$B$9:$AF$10000=Listes!$G$15))/2)","v":0}]
[{"$f":" IF(Employés!$E$13=\"\",\"\",Employés!$E$13)","v":""},{"$f":"SUMPRODUCT(('Planning mensuel congés'!$A$9:$A$10000=$A15)*('Planning mensuel congés'!$B$9:$AF$10000=Listes!$G$9)+('Planning mensuel congés'!$A$9:$A$10000=$A15)*(('Planning mensuel congés'!$B$9:$AF$10000=Listes!$G$9))/2)","v":0},{"$f":"SUMPRODUCT(('Planning mensuel congés'!$A$9:$A$10000=$A15)*('Planning mensuel congés'!$B$9:$AF$10000=Listes!$G$13)+('Planning mensuel congés'!$A$9:$A$10000=$A15)*(('Planning mensuel congés'!$B$9:$AF$10000=Listes!$G$14))/2)","v":0},{"$f":"SUMPRODUCT(('Planning mensuel congés'!$A$9:$A$10000=$A15)*('Planning mensuel congés'!$B$9:$AF$10000=Listes!$G$8)+('Planning mensuel congés'!$A$9:$A$10000=$A15)*(('Planning mensuel congés'!$B$9:$AF$10000=Listes!$G$17))/2)","v":0},{"$f":"SUMPRODUCT(('Planning mensuel congés'!$A$9:$A$10000=$A15)*('Planning mensuel congés'!$B$9:$AF$10000=Listes!$G$12)+('Planning mensuel congés'!$A$9:$A$10000=$A15)*(('Planning mensuel congés'!$B$9:$AF$10000=Listes!$G$18))/2)","v":0},{"$f":"SUMPRODUCT(('Planning mensuel congés'!$A$9:$A$10000=$A15)*('Planning mensuel congés'!$B$9:$AF$10000=Listes!$G$11)+('Planning mensuel congés'!$A$9:$A$10000=$A15)*(('Planning mensuel congés'!$B$9:$AF$10000=Listes!$G$19))/2)","v":0},{"$f":"SUMPRODUCT(('Planning mensuel congés'!$A$9:$A$10000=$A15)*('Planning mensuel congés'!$B$9:$AF$10000=Listes!$G$7)+('Planning mensuel congés'!$A$9:$A$10000=$A15)*(('Planning mensuel congés'!$B$9:$AF$10000=Listes!$G$16))/2)","v":0},{"$f":"SUMPRODUCT(('Planning mensuel congés'!$A$9:$A$10000=$A15)*('Planning mensuel congés'!$B$9:$AF$10000=Listes!$G$6)+('Planning mensuel congés'!$A$9:$A$10000=$A15)*(('Planning mensuel congés'!$B$9:$AF$10000=Listes!$G$15))/2)","v":0}]
[{"$f":" IF(Employés!$E$14=\"\",\"\",Employés!$E$14)","v":""},{"$f":"SUMPRODUCT(('Planning mensuel congés'!$A$9:$A$10000=$A16)*('Planning mensuel congés'!$B$9:$AF$10000=Listes!$G$9)+('Planning mensuel congés'!$A$9:$A$10000=$A16)*(('Planning mensuel congés'!$B$9:$AF$10000=Listes!$G$9))/2)","v":0},{"$f":"SUMPRODUCT(('Planning mensuel congés'!$A$9:$A$10000=$A16)*('Planning mensuel congés'!$B$9:$AF$10000=Listes!$G$13)+('Planning mensuel congés'!$A$9:$A$10000=$A16)*(('Planning mensuel congés'!$B$9:$AF$10000=Listes!$G$14))/2)","v":0},{"$f":"SUMPRODUCT(('Planning mensuel congés'!$A$9:$A$10000=$A16)*('Planning mensuel congés'!$B$9:$AF$10000=Listes!$G$8)+('Planning mensuel congés'!$A$9:$A$10000=$A16)*(('Planning mensuel congés'!$B$9:$AF$10000=Listes!$G$17))/2)","v":0},{"$f":"SUMPRODUCT(('Planning mensuel congés'!$A$9:$A$10000=$A16)*('Planning mensuel congés'!$B$9:$AF$10000=Listes!$G$12)+('Planning mensuel congés'!$A$9:$A$10000=$A16)*(('Planning mensuel congés'!$B$9:$AF$10000=Listes!$G$18))/2)","v":0},{"$f":"SUMPRODUCT(('Planning mensuel congés'!$A$9:$A$10000=$A16)*('Planning mensuel congés'!$B$9:$AF$10000=Listes!$G$11)+('Planning mensuel congés'!$A$9:$A$10000=$A16)*(('Planning mensuel congés'!$B$9:$AF$10000=Listes!$G$19))/2)","v":0},{"$f":"SUMPRODUCT(('Planning mensuel congés'!$A$9:$A$10000=$A16)*('Planning mensuel congés'!$B$9:$AF$10000=Listes!$G$7)+('Planning mensuel congés'!$A$9:$A$10000=$A16)*(('Planning mensuel congés'!$B$9:$AF$10000=Listes!$G$16))/2)","v":0},{"$f":"SUMPRODUCT(('Planning mensuel congés'!$A$9:$A$10000=$A16)*('Planning mensuel congés'!$B$9:$AF$10000=Listes!$G$6)+('Planning mensuel congés'!$A$9:$A$10000=$A16)*(('Planning mensuel congés'!$B$9:$AF$10000=Listes!$G$15))/2)","v":0}]
[{"$f":" IF(Employés!$E$15=\"\",\"\",Employés!$E$15)","v":""},{"$f":"SUMPRODUCT(('Planning mensuel congés'!$A$9:$A$10000=$A17)*('Planning mensuel congés'!$B$9:$AF$10000=Listes!$G$9)+('Planning mensuel congés'!$A$9:$A$10000=$A17)*(('Planning mensuel congés'!$B$9:$AF$10000=Listes!$G$9))/2)","v":0},{"$f":"SUMPRODUCT(('Planning mensuel congés'!$A$9:$A$10000=$A17)*('Planning mensuel congés'!$B$9:$AF$10000=Listes!$G$13)+('Planning mensuel congés'!$A$9:$A$10000=$A17)*(('Planning mensuel congés'!$B$9:$AF$10000=Listes!$G$14))/2)","v":0},{"$f":"SUMPRODUCT(('Planning mensuel congés'!$A$9:$A$10000=$A17)*('Planning mensuel congés'!$B$9:$AF$10000=Listes!$G$8)+('Planning mensuel congés'!$A$9:$A$10000=$A17)*(('Planning mensuel congés'!$B$9:$AF$10000=Listes!$G$17))/2)","v":0},{"$f":"SUMPRODUCT(('Planning mensuel congés'!$A$9:$A$10000=$A17)*('Planning mensuel congés'!$B$9:$AF$10000=Listes!$G$12)+('Planning mensuel congés'!$A$9:$A$10000=$A17)*(('Planning mensuel congés'!$B$9:$AF$10000=Listes!$G$18))/2)","v":0},{"$f":"SUMPRODUCT(('Planning mensuel congés'!$A$9:$A$10000=$A17)*('Planning mensuel congés'!$B$9:$AF$10000=Listes!$G$11)+('Planning mensuel congés'!$A$9:$A$10000=$A17)*(('Planning mensuel congés'!$B$9:$AF$10000=Listes!$G$19))/2)","v":0},{"$f":"SUMPRODUCT(('Planning mensuel congés'!$A$9:$A$10000=$A17)*('Planning mensuel congés'!$B$9:$AF$10000=Listes!$G$7)+('Planning mensuel congés'!$A$9:$A$10000=$A17)*(('Planning mensuel congés'!$B$9:$AF$10000=Listes!$G$16))/2)","v":0},{"$f":"SUMPRODUCT(('Planning mensuel congés'!$A$9:$A$10000=$A17)*('Planning mensuel congés'!$B$9:$AF$10000=Listes!$G$6)+('Planning mensuel congés'!$A$9:$A$10000=$A17)*(('Planning mensuel congés'!$B$9:$AF$10000=Listes!$G$15))/2)","v":0}]
["TOTAL ",{"$f":"SUM(B8:B17)","v":0},{"$f":"SUM(C8:C17)","v":0},0,0,0,0,0]

{"sheet":"Listes","index":3,"n_rows":84,"n_cols":7,"rows_kept":84,"cut":false,"hidden":true,"merged":[[4,3,4,4],[0,3,2,6]]}
[null,null,null,"Listes "]
[]
[]
[]
[null,"Années",null,"Jours fériés",null,null,"Type d'absence"]
[null,2022,null,"Jour de l'an","2022-01-01",null,"AUTRE"]
[null,2023,null,"Lundi de Pâques",{"$f":"IF(OR('Planning mensuel congés'!$E$5=\"\",'Planning mensuel congés'!$E$5=\"Année\"),\"Entrer année\",(FLOOR(DAY(MINUTE('Planning mensuel congés'!$E$5/38)/2+56)&\"/5/\"&'Planning mensuel congés'!$E$5,7)-34)+1)","v":"Entrer année"},null,"ABS. NON AUT."]
[null,2024,null,"Fête du travail","2022-05-01",null,"ABS. AUT."]
[null,2025,null,"Victoire de 1945","2022-05-08",null,"C."]
[null,2026,null,"Ascension",{"$f":"IF(OR('Planning mensuel congés'!$E$5=\"\",'Planning mensuel congés'!$E$5=\"Année\"),\"Entrer année\",(FLOOR(DAY(MINUTE('Planning mensuel congés'!$E$5/38)/2+56)&\"/5/\"&'Planning mensuel congés'!$E$5,7)-34)+39)","v":"Entrer année"},null,"C./2"]
[null,2027,null,"Lundi de Pentecôte",{"$f":"IF(OR('Planning mensuel congés'!$E$5=\"\",'Planning mensuel congés'!$E$5=\"Année\"),\"Entrer année\",(FLOOR(DAY(MINUTE('Planning mensuel congés'!$E$5/38)/2+56)&\"/5/\"&'Planning mensuel congés'!$E$5,7)-34)+50)","v":"Entrer année"},null,"MAL."]
[null,2028,null,"Fête nationale","2022-07-14",null,"S.S."]
[null,2029,null,"Assomption","2022-08-15",null,"RTT"]
[null,2030,null,"Toussaint","2022-11-01",null,"RTT/2"]
[null,2031,null,"Armistice","2022-11-11",null,"AUTRE/2"]
[null,2032,null,"Nöel","2022-12-25",null,"ABS. NON AUT./2"]
[null,2033,null,null,null,null,"ABS. AUT./2"]
[null,2034,null,null,null,null,"S.S./2"]
[null,2035,null,null,null,null,"MAL./2"]
[null,2036]
{"$rows_left_out":65}
{"sheet":"Instructions","index":4,"n_rows":14,"n_cols":4,"rows_kept":14,"cut":false,"hidden":false,"merged":[[13,3,13,7],[0,2,2,9],[12,3,12,7],[11,3,11,7],[10,3,10,7],[8,3,8,7],[9,3,9,7]]}
[null,null,"Planning congés - Instructions"]
[]
[]
[]
[null,"La saisie de donnée se fait dans l'onglet \"Planning mensuel congés\""]
[null,"L'onglet \"Synthèse congés annuel\" permet d'avoir une vision synthétique du nombre de congé pris par les employés"]
[null,"Un onglet masqué \"Liste\" est disponible pour mettre à jour les listes déroulantes (si besoin)"]
[]
[null,null,"Etape","Description"]
[null,null,1,"Compléter le nom des employées dans l'onglet  \"Employés\" et la colonne \"Liste employés\""]
[null,null,2,"Entrer le nom du service dans l'onglet \"Planning mensuel congés\""]
[null,null,3,"Sélectionner ou compléter l'année dans l'onglet \"Planning mensuel congés\""]
[null,null,4,"Sélectionner à l'aide de la liste déroulante le type d'absence souhaité pour chaque employé dans l'onglet \"Planning mensuel congés\". L'absence s'affiche en une couleur spécifique en fonction de son type"]
[null,null,5,"Si vous souhaitez réinitialiser le fichier, cliquer sur le bouton \"REINITIALISER\" puis sur \"Oui\". Après avoir cliquer sur le bouton \"REINITIALISER\", si vous ne souhaitez plus effectuer cette action, cliquer sur \"Non\" puis sur \"OK\" dans la fenêtre qui s'affichera."]