{"text_format":"1","workbook":"xlsx","n_sheets":4,"sheets":["Calcul heures travail","Synthèse annuelle heures","Listes","Instructions"],"not_rendered":{"charts":0,"images":4,"macros":1,"external_links":0,"defined_names":1,"comments":0,"pivot_tables":0},"unopened":[],"bounds":{"document_bytes":16777216,"sheet_cells":100000,"rows_first":2000,"rows_last":500,"rows_between":2000,"halvings":0,"cell_chars":16384,"cell_head_chars":4096},"cells_cut":0,"cells_raw":0,"read":"whole","date_system":"1900"}

{"sheet":"Calcul heures travail","index":0,"n_rows":52,"n_cols":10,"rows_kept":52,"cut":false,"hidden":false,"merged":[[0,2,1,9],[13,4,13,5],[13,6,13,7]]}
[null,null,"Calcul des heures de travail"]
[]
[]
[]
["Nom Entreprise","Nom Entreprise",null,null,"EMPLOYE:","Prénom NOM"]
[]
["Année",null,"Mois",null,null,"Heure dues par semaine",null,null,"Report d'heures:"]
[null,null,"Numéro mois",{"$f":"IF($D$7=\"\",\"\",MONTH($D$7&\"1\"))","v":""},null,"Nombre de jours travaillés par semaine",null,null,"Dues par employé",{"$f":"$I$51","v":""}]
[null,null,"Nombre jours mois",{"$f":"IF(OR($B$7=\"\",$D$7=\"\",$D$8=\"\"),\"\",DAY(DATE($B$7,$D$8+1,1)-1))","v":""},null,"Heures dues par mois",{"$f":"IF(OR($G$7=\"\",$D$10=\"\"),\"Compléter heures dues / semaine et Année\",($G$7*52)/12)","v":"Compléter heures dues / semaine et Année"},null,"Dues par entreprise",{"$f":"$I$52","v":0}]
[null,null,"Nombre de jours ouvrés ",{"$f":"IF(OR($B$7=\"\",$D$7=\"\",$D$8=\"\"),\"\",NETWORKDAYS(DATE($B$7,$D$8,1),DATE($B$7,$D$8,$D$9),Listes!$G$7:$G$1000))","v":""},null,"Heures dues par jour",{"$f":"IF(OR($G$9=\"\",$G$9=\"Compléter heures dues / semaine et Année\", $D$10=\"\"),\"\",$G$9/$D$10)","v":""}]
[]
["Jour férié",null,"Week-end"]
[]
[null,null,null,null,"Matin",null,"Après-midi"]
["Semaine","Jour","Jour ","Mois","Arrivée","Départ","Arrivée","Départ","Totaux journaliers","Heures supplémentaires"]
[{"$f":"IF(OR($B$7=\"\",$D$7=\"\",$D$8=\"\",$C16=\"\"),\"\",_xlfn.ISOWEEKNUM(DATE($B$7,$D$8,$C16)))","v":""},{"$f":"IF(OR($B$7=\"\",$D$7=\"\",$D$8=\"\",$C16=\"\"),\"\",TEXT(DATE($B$7,$D$8,$C16),\"dddd\"))","v":""},{"$f":"IF(OR($B$7=\"\",$D$7=\"\",$D$8=\"\"),\"\",DAY(DATE($B$7,$D$8+1,1)-1)-DAY(DATE($B$7,$D$8+1,1)-1)+1)","v":""},{"$f":"IF(OR($D$7=\"\",$C16=\"\"),\"\",$D$7)","v":""},null,null,null,null,{"$f":"IF($G$10=\"\",\"\",IF(OR(ISTEXT($G16),ISTEXT($H16),ISTEXT($E16),ISTEXT($F16)),(((COUNTIF($E16:$H16,Listes!$I$7)+COUNTIF($E16:$H16,Listes!$I$9)+COUNTIF($E16:$H16,Listes!$I$12))*$G$10)/4))+IF(OR(ISTEXT($F16),ISTEXT($E16)),\"0\",($F16-$E16)*24)+IF(OR(ISTEXT($H16),ISTEXT($G16)),\"0\",($H16-$G16)*24))","v":""},{"$f":"_xlfn.IFS(OR(I16=\"\",I16=\"Compléter G9\"),\"0,00\",I16>=$G$10,I16-$G$10,I16<$G$10,\"\")","v":"0,00"}]
[{"$f":"IF(OR($B$7=\"\",$D$7=\"\",$D$8=\"\",$C17=\"\"),\"\",_xlfn.ISOWEEKNUM(DATE($B$7,$D$8,$C17)))","v":""},{"$f":"IF(OR($B$7=\"\",$D$7=\"\",$D$8=\"\",$C17=\"\"),\"\",TEXT(DATE($B$7,$D$8,$C17),\"dddd\"))","v":""},{"$f":"_xlfn.IFS($C16=\"\",\"\",$C16<$D$9,$C16+1,$C16=$D$9,\"\")","v":""},{"$f":"IF(OR($D$7=\"\",$C17=\"\"),\"\",$D$7)","v":""},null,null,null,null,{"$f":"IF($G$10=\"\",\"\",IF(OR(ISTEXT($G17),ISTEXT($H17),ISTEXT($E17),ISTEXT($F17)),(((COUNTIF($E17:$H17,Listes!$I$7)+COUNTIF($E17:$H17,Listes!$I$9)+COUNTIF($E17:$H17,Listes!$I$12))*$G$10)/4))+IF(OR(ISTEXT($F17),ISTEXT($E17)),\"0\",($F17-$E17)*24)+IF(OR(ISTEXT($H17),ISTEXT($G17)),\"0\",($H17-$G17)*24))","v":""},{"$f":"_xlfn.IFS(OR(I17=\"\",I17=\"Compléter G9\"),\"0,00\",I17>=$G$10,I17-$G$10,I17<$G$10,\"\")","v":"0,00"}]
["","",{"$f":"_xlfn.IFS($C17=\"\",\"\",$C17<$D$9,$C17+1,$C17=$D$9,\"\")","v":""},"",null,null,null,null,{"$f":"IF($G$10=\"\",\"\",IF(OR(ISTEXT($G18),ISTEXT($H18),ISTEXT($E18),ISTEXT($F18)),(((COUNTIF($E18:$H18,Listes!$I$7)+COUNTIF($E18:$H18,Listes!$I$9)+COUNTIF($E18:$H18,Listes!$I$12))*$G$10)/4))+IF(OR(ISTEXT($F18),ISTEXT($E18)),\"0\",($F18-$E18)*24)+IF(OR(ISTEXT($H18),ISTEXT($G18)),\"0\",($H18-$G18)*24))","v":""},{"$f":"_xlfn.IFS(OR(I18=\"\",I18=\"Compléter G9\"),\"0,00\",I18>=$G$10,I18-$G$10,I18<$G$10,\"\")","v":"0,00"}]
["","",{"$f":"_xlfn.IFS($C18=\"\",\"\",$C18<$D$9,$C18+1,$C18=$D$9,\"\")","v":""},"",null,null,null,null,{"$f":"IF($G$10=\"\",\"\",IF(OR(ISTEXT($G19),ISTEXT($H19),ISTEXT($E19),ISTEXT($F19)),(((COUNTIF($E19:$H19,Listes!$I$7)+COUNTIF($E19:$H19,Listes!$I$9)+COUNTIF($E19:$H19,Listes!$I$12))*$G$10)/4))+IF(OR(ISTEXT($F19),ISTEXT($E19)),\"0\",($F19-$E19)*24)+IF(OR(ISTEXT($H19),ISTEXT($G19)),\"0\",($H19-$G19)*24))","v":""},{"$f":"_xlfn.IFS(OR(I19=\"\",I19=\"Compléter G9\"),\"0,00\",I19>=$G$10,I19-$G$10,I19<$G$10,\"\")","v":"0,00"}]
["","",{"$f":"_xlfn.IFS($C19=\"\",\"\",$C19<$D$9,$C19+1,$C19=$D$9,\"\")","v":""},"",null,null,null,null,{"$f":"IF($G$10=\"\",\"\",IF(OR(ISTEXT($G20),ISTEXT($H20),ISTEXT($E20),ISTEXT($F20)),(((COUNTIF($E20:$H20,Listes!$I$7)+COUNTIF($E20:$H20,Listes!$I$9)+COUNTIF($E20:$H20,Listes!$I$12))*$G$10)/4))+IF(OR(ISTEXT($F20),ISTEXT($E20)),\"0\",($F20-$E20)*24)+IF(OR(ISTEXT($H20),ISTEXT($G20)),\"0\",($H20-$G20)*24))","v":""},{"$f":"_xlfn.IFS(OR(I20=\"\",I20=\"Compléter G9\"),\"0,00\",I20>=$G$10,I20-$G$10,I20<$G$10,\"\")","v":"0,00"}]
["","",{"$f":"_xlfn.IFS($C20=\"\",\"\",$C20<$D$9,$C20+1,$C20=$D$9,\"\")","v":""},"",null,null,null,null,{"$f":"IF($G$10=\"\",\"\",IF(OR(ISTEXT($G21),ISTEXT($H21),ISTEXT($E21),ISTEXT($F21)),(((COUNTIF($E21:$H21,Listes!$I$7)+COUNTIF($E21:$H21,Listes!$I$9)+COUNTIF($E21:$H21,Listes!$I$12))*$G$10)/4))+IF(OR(ISTEXT($F21),ISTEXT($E21)),\"0\",($F21-$E21)*24)+IF(OR(ISTEXT($H21),ISTEXT($G21)),\"0\",($H21-$G21)*24))","v":""},{"$f":"_xlfn.IFS(OR(I21=\"\",I21=\"Compléter G9\"),\"0,00\",I21>=$G$10,I21-$G$10,I21<$G$10,\"\")","v":"0,00"}]
["","",{"$f":"_xlfn.IFS($C21=\"\",\"\",$C21<$D$9,$C21+1,$C21=$D$9,\"\")","v":""},"",null,null,null,null,{"$f":"IF($G$10=\"\",\"\",IF(OR(ISTEXT($G22),ISTEXT($H22),ISTEXT($E22),ISTEXT($F22)),(((COUNTIF($E22:$H22,Listes!$I$7)+COUNTIF($E22:$H22,Listes!$I$9)+COUNTIF($E22:$H22,Listes!$I$12))*$G$10)/4))+IF(OR(ISTEXT($F22),ISTEXT($E22)),\"0\",($F22-$E22)*24)+IF(OR(ISTEXT($H22),ISTEXT($G22)),\"0\",($H22-$G22)*24))","v":""},{"$f":"_xlfn.IFS(OR(I22=\"\",I22=\"Compléter G9\"),\"0,00\",I22>=$G$10,I22-$G$10,I22<$G$10,\"\")","v":"0,00"}]
["","",{"$f":"_xlfn.IFS($C22=\"\",\"\",$C22<$D$9,$C22+1,$C22=$D$9,\"\")","v":""},"",null,null,null,null,{"$f":"IF($G$10=\"\",\"\",IF(OR(ISTEXT($G23),ISTEXT($H23),ISTEXT($E23),ISTEXT($F23)),(((COUNTIF($E23:$H23,Listes!$I$7)+COUNTIF($E23:$H23,Listes!$I$9)+COUNTIF($E23:$H23,Listes!$I$12))*$G$10)/4))+IF(OR(ISTEXT($F23),ISTEXT($E23)),\"0\",($F23-$E23)*24)+IF(OR(ISTEXT($H23),ISTEXT($G23)),\"0\",($H23-$G23)*24))","v":""},{"$f":"_xlfn.IFS(OR(I23=\"\",I23=\"Compléter G9\"),\"0,00\",I23>=$G$10,I23-$G$10,I23<$G$10,\"\")","v":"0,00"}]
["","",{"$f":"_xlfn.IFS($C23=\"\",\"\",$C23<$D$9,$C23+1,$C23=$D$9,\"\")","v":""},"",null,null,null,null,{"$f":"IF($G$10=\"\",\"\",IF(OR(ISTEXT($G24),ISTEXT($H24),ISTEXT($E24),ISTEXT($F24)),(((COUNTIF($E24:$H24,Listes!$I$7)+COUNTIF($E24:$H24,Listes!$I$9)+COUNTIF($E24:$H24,Listes!$I$12))*$G$10)/4))+IF(OR(ISTEXT($F24),ISTEXT($E24)),\"0\",($F24-$E24)*24)+IF(OR(ISTEXT($H24),ISTEXT($G24)),\"0\",($H24-$G24)*24))","v":""},{"$f":"_xlfn.IFS(OR(I24=\"\",I24=\"Compléter G9\"),\"0,00\",I24>=$G$10,I24-$G$10,I24<$G$10,\"\")","v":"0,00"}]
["","",{"$f":"_xlfn.IFS($C24=\"\",\"\",$C24<$D$9,$C24+1,$C24=$D$9,\"\")","v":""},"",null,null,null,null,{"$f":"IF($G$10=\"\",\"\",IF(OR(ISTEXT($G25),ISTEXT($H25),ISTEXT($E25),ISTEXT($F25)),(((COUNTIF($E25:$H25,Listes!$I$7)+COUNTIF($E25:$H25,Listes!$I$9)+COUNTIF($E25:$H25,Listes!$I$12))*$G$10)/4))+IF(OR(ISTEXT($F25),ISTEXT($E25)),\"0\",($F25-$E25)*24)+IF(OR(ISTEXT($H25),ISTEXT($G25)),\"0\",($H25-$G25)*24))","v":""},{"$f":"_xlfn.IFS(OR(I25=\"\",I25=\"Compléter G9\"),\"0,00\",I25>=$G$10,I25-$G$10,I25<$G$10,\"\")","v":"0,00"}]
["","",{"$f":"_xlfn.IFS($C25=\"\",\"\",$C25<$D$9,$C25+1,$C25=$D$9,\"\")","v":""},"",null,null,null,null,{"$f":"IF($G$10=\"\",\"\",IF(OR(ISTEXT($G26),ISTEXT($H26),ISTEXT($E26),ISTEXT($F26)),(((COUNTIF($E26:$H26,Listes!$I$7)+COUNTIF($E26:$H26,Listes!$I$9)+COUNTIF($E26:$H26,Listes!$I$12))*$G$10)/4))+IF(OR(ISTEXT($F26),ISTEXT($E26)),\"0\",($F26-$E26)*24)+IF(OR(ISTEXT($H26),ISTEXT($G26)),\"0\",($H26-$G26)*24))","v":""},{"$f":"_xlfn.IFS(OR(I26=\"\",I26=\"Compléter G9\"),\"0,00\",I26>=$G$10,I26-$G$10,I26<$G$10,\"\")","v":"0,00"}]
["","",{"$f":"_xlfn.IFS($C26=\"\",\"\",$C26<$D$9,$C26+1,$C26=$D$9,\"\")","v":""},"",null,null,null,null,{"$f":"IF($G$10=\"\",\"\",IF(OR(ISTEXT($G27),ISTEXT($H27),ISTEXT($E27),ISTEXT($F27)),(((COUNTIF($E27:$H27,Listes!$I$7)+COUNTIF($E27:$H27,Listes!$I$9)+COUNTIF($E27:$H27,Listes!$I$12))*$G$10)/4))+IF(OR(ISTEXT($F27),ISTEXT($E27)),\"0\",($F27-$E27)*24)+IF(OR(ISTEXT($H27),ISTEXT($G27)),\"0\",($H27-$G27)*24))","v":""},{"$f":"_xlfn.IFS(OR(I27=\"\",I27=\"Compléter G9\"),\"0,00\",I27>=$G$10,I27-$G$10,I27<$G$10,\"\")","v":"0,00"}]
["","",{"$f":"_xlfn.IFS($C27=\"\",\"\",$C27<$D$9,$C27+1,$C27=$D$9,\"\")","v":""},"",null,null,null,null,{"$f":"IF($G$10=\"\",\"\",IF(OR(ISTEXT($G28),ISTEXT($H28),ISTEXT($E28),ISTEXT($F28)),(((COUNTIF($E28:$H28,Listes!$I$7)+COUNTIF($E28:$H28,Listes!$I$9)+COUNTIF($E28:$H28,Listes!$I$12))*$G$10)/4))+IF(OR(ISTEXT($F28),ISTEXT($E28)),\"0\",($F28-$E28)*24)+IF(OR(ISTEXT($H28),ISTEXT($G28)),\"0\",($H28-$G28)*24))","v":""},{"$f":"_xlfn.IFS(OR(I28=\"\",I28=\"Compléter G9\"),\"0,00\",I28>=$G$10,I28-$G$10,I28<$G$10,\"\")","v":"0,00"}]
["","",{"$f":"_xlfn.IFS($C28=\"\",\"\",$C28<$D$9,$C28+1,$C28=$D$9,\"\")","v":""},"",null,null,null,null,{"$f":"IF($G$10=\"\",\"\",IF(OR(ISTEXT($G29),ISTEXT($H29),ISTEXT($E29),ISTEXT($F29)),(((COUNTIF($E29:$H29,Listes!$I$7)+COUNTIF($E29:$H29,Listes!$I$9)+COUNTIF($E29:$H29,Listes!$I$12))*$G$10)/4))+IF(OR(ISTEXT($F29),ISTEXT($E29)),\"0\",($F29-$E29)*24)+IF(OR(ISTEXT($H29),ISTEXT($G29)),\"0\",($H29-$G29)*24))","v":""},{"$f":"_xlfn.IFS(OR(I29=\"\",I29=\"Compléter G9\"),\"0,00\",I29>=$G$10,I29-$G$10,I29<$G$10,\"\")","v":"0,00"}]
["","",{"$f":"_xlfn.IFS($C29=\"\",\"\",$C29<$D$9,$C29+1,$C29=$D$9,\"\")","v":""},"",null,null,null,null,{"$f":"IF($G$10=\"\",\"\",IF(OR(ISTEXT($G30),ISTEXT($H30),ISTEXT($E30),ISTEXT($F30)),(((COUNTIF($E30:$H30,Listes!$I$7)+COUNTIF($E30:$H30,Listes!$I$9)+COUNTIF($E30:$H30,Listes!$I$12))*$G$10)/4))+IF(OR(ISTEXT($F30),ISTEXT($E30)),\"0\",($F30-$E30)*24)+IF(OR(ISTEXT($H30),ISTEXT($G30)),\"0\",($H30-$G30)*24))","v":""},{"$f":"_xlfn.IFS(OR(I30=\"\",I30=\"Compléter G9\"),\"0,00\",I30>=$G$10,I30-$G$10,I30<$G$10,\"\")","v":"0,00"}]
["","",{"$f":"_xlfn.IFS($C30=\"\",\"\",$C30<$D$9,$C30+1,$C30=$D$9,\"\")","v":""},"",null,null,null,null,{"$f":"IF($G$10=\"\",\"\",IF(OR(ISTEXT($G31),ISTEXT($H31),ISTEXT($E31),ISTEXT($F31)),(((COUNTIF($E31:$H31,Listes!$I$7)+COUNTIF($E31:$H31,Listes!$I$9)+COUNTIF($E31:$H31,Listes!$I$12))*$G$10)/4))+IF(OR(ISTEXT($F31),ISTEXT($E31)),\"0\",($F31-$E31)*24)+IF(OR(ISTEXT($H31),ISTEXT($G31)),\"0\",($H31-$G31)*24))","v":""},{"$f":"_xlfn.IFS(OR(I31=\"\",I31=\"Compléter G9\"),\"0,00\",I31>=$G$10,I31-$G$10,I31<$G$10,\"\")","v":"0,00"}]
["","",{"$f":"_xlfn.IFS($C31=\"\",\"\",$C31<$D$9,$C31+1,$C31=$D$9,\"\")","v":""},"",null,null,null,null,{"$f":"IF($G$10=\"\",\"\",IF(OR(ISTEXT($G32),ISTEXT($H32),ISTEXT($E32),ISTEXT($F32)),(((COUNTIF($E32:$H32,Listes!$I$7)+COUNTIF($E32:$H32,Listes!$I$9)+COUNTIF($E32:$H32,Listes!$I$12))*$G$10)/4))+IF(OR(ISTEXT($F32),ISTEXT($E32)),\"0\",($F32-$E32)*24)+IF(OR(ISTEXT($H32),ISTEXT($G32)),\"0\",($H32-$G32)*24))","v":""},{"$f":"_xlfn.IFS(OR(I32=\"\",I32=\"Compléter G9\"),\"0,00\",I32>=$G$10,I32-$G$10,I32<$G$10,\"\")","v":"0,00"}]
["","",{"$f":"_xlfn.IFS($C32=\"\",\"\",$C32<$D$9,$C32+1,$C32=$D$9,\"\")","v":""},"",null,null,null,null,{"$f":"IF($G$10=\"\",\"\",IF(OR(ISTEXT($G33),ISTEXT($H33),ISTEXT($E33),ISTEXT($F33)),(((COUNTIF($E33:$H33,Listes!$I$7)+COUNTIF($E33:$H33,Listes!$I$9)+COUNTIF($E33:$H33,Listes!$I$12))*$G$10)/4))+IF(OR(ISTEXT($F33),ISTEXT($E33)),\"0\",($F33-$E33)*24)+IF(OR(ISTEXT($H33),ISTEXT($G33)),\"0\",($H33-$G33)*24))","v":""},{"$f":"_xlfn.IFS(OR(I33=\"\",I33=\"Compléter G9\"),\"0,00\",I33>=$G$10,I33-$G$10,I33<$G$10,\"\")","v":"0,00"}]
["","",{"$f":"_xlfn.IFS($C33=\"\",\"\",$C33<$D$9,$C33+1,$C33=$D$9,\"\")","v":""},"",null,null,null,null,{"$f":"IF($G$10=\"\",\"\",IF(OR(ISTEXT($G34),ISTEXT($H34),ISTEXT($E34),ISTEXT($F34)),(((COUNTIF($E34:$H34,Listes!$I$7)+COUNTIF($E34:$H34,Listes!$I$9)+COUNTIF($E34:$H34,Listes!$I$12))*$G$10)/4))+IF(OR(ISTEXT($F34),ISTEXT($E34)),\"0\",($F34-$E34)*24)+IF(OR(ISTEXT($H34),ISTEXT($G34)),\"0\",($H34-$G34)*24))","v":""},{"$f":"_xlfn.IFS(OR(I34=\"\",I34=\"Compléter G9\"),\"0,00\",I34>=$G$10,I34-$G$10,I34<$G$10,\"\")","v":"0,00"}]
["","",{"$f":"_xlfn.IFS($C34=\"\",\"\",$C34<$D$9,$C34+1,$C34=$D$9,\"\")","v":""},"",null,null,null,null,{"$f":"IF($G$10=\"\",\"\",IF(OR(ISTEXT($G35),ISTEXT($H35),ISTEXT($E35),ISTEXT($F35)),(((COUNTIF($E35:$H35,Listes!$I$7)+COUNTIF($E35:$H35,Listes!$I$9)+COUNTIF($E35:$H35,Listes!$I$12))*$G$10)/4))+IF(OR(ISTEXT($F35),ISTEXT($E35)),\"0\",($F35-$E35)*24)+IF(OR(ISTEXT($H35),ISTEXT($G35)),\"0\",($H35-$G35)*24))","v":""},{"$f":"_xlfn.IFS(OR(I35=\"\",I35=\"Compléter G9\"),\"0,00\",I35>=$G$10,I35-$G$10,I35<$G$10,\"\")","v":"0,00"}]
["","",{"$f":"_xlfn.IFS($C35=\"\",\"\",$C35<$D$9,$C35+1,$C35=$D$9,\"\")","v":""},"",null,null,null,null,{"$f":"IF($G$10=\"\",\"\",IF(OR(ISTEXT($G36),ISTEXT($H36),ISTEXT($E36),ISTEXT($F36)),(((COUNTIF($E36:$H36,Listes!$I$7)+COUNTIF($E36:$H36,Listes!$I$9)+COUNTIF($E36:$H36,Listes!$I$12))*$G$10)/4))+IF(OR(ISTEXT($F36),ISTEXT($E36)),\"0\",($F36-$E36)*24)+IF(OR(ISTEXT($H36),ISTEXT($G36)),\"0\",($H36-$G36)*24))","v":""},{"$f":"_xlfn.IFS(OR(I36=\"\",I36=\"Compléter G9\"),\"0,00\",I36>=$G$10,I36-$G$10,I36<$G$10,\"\")","v":"0,00"}]
["","",{"$f":"_xlfn.IFS($C36=\"\",\"\",$C36<$D$9,$C36+1,$C36=$D$9,\"\")","v":""},"",null,null,null,null,{"$f":"IF($G$10=\"\",\"\",IF(OR(ISTEXT($G37),ISTEXT($H37),ISTEXT($E37),ISTEXT($F37)),(((COUNTIF($E37:$H37,Listes!$I$7)+COUNTIF($E37:$H37,Listes!$I$9)+COUNTIF($E37:$H37,Listes!$I$12))*$G$10)/4))+IF(OR(ISTEXT($F37),ISTEXT($E37)),\"0\",($F37-$E37)*24)+IF(OR(ISTEXT($H37),ISTEXT($G37)),\"0\",($H37-$G37)*24))","v":""},{"$f":"_xlfn.IFS(OR(I37=\"\",I37=\"Compléter G9\"),\"0,00\",I37>=$G$10,I37-$G$10,I37<$G$10,\"\")","v":"0,00"}]
["","",{"$f":"_xlfn.IFS($C37=\"\",\"\",$C37<$D$9,$C37+1,$C37=$D$9,\"\")","v":""},"",null,null,null,null,{"$f":"IF($G$10=\"\",\"\",IF(OR(ISTEXT($G38),ISTEXT($H38),ISTEXT($E38),ISTEXT($F38)),(((COUNTIF($E38:$H38,Listes!$I$7)+COUNTIF($E38:$H38,Listes!$I$9)+COUNTIF($E38:$H38,Listes!$I$12))*$G$10)/4))+IF(OR(ISTEXT($F38),ISTEXT($E38)),\"0\",($F38-$E38)*24)+IF(OR(ISTEXT($H38),ISTEXT($G38)),\"0\",($H38-$G38)*24))","v":""},{"$f":"_xlfn.IFS(OR(I38=\"\",I38=\"Compléter G9\"),\"0,00\",I38>=$G$10,I38-$G$10,I38<$G$10,\"\")","v":"0,00"}]
["","",{"$f":"_xlfn.IFS($C38=\"\",\"\",$C38<$D$9,$C38+1,$C38=$D$9,\"\")","v":""},"",null,null,null,null,{"$f":"IF($G$10=\"\",\"\",IF(OR(ISTEXT($G39),ISTEXT($H39),ISTEXT($E39),ISTEXT($F39)),(((COUNTIF($E39:$H39,Listes!$I$7)+COUNTIF($E39:$H39,Listes!$I$9)+COUNTIF($E39:$H39,Listes!$I$12))*$G$10)/4))+IF(OR(ISTEXT($F39),ISTEXT($E39)),\"0\",($F39-$E39)*24)+IF(OR(ISTEXT($H39),ISTEXT($G39)),\"0\",($H39-$G39)*24))","v":""},{"$f":"_xlfn.IFS(OR(I39=\"\",I39=\"Compléter G9\"),\"0,00\",I39>=$G$10,I39-$G$10,I39<$G$10,\"\")","v":"0,00"}]
["","",{"$f":"_xlfn.IFS($C39=\"\",\"\",$C39<$D$9,$C39+1,$C39=$D$9,\"\")","v":""},"",null,null,null,null,{"$f":"IF($G$10=\"\",\"\",IF(OR(ISTEXT($G40),ISTEXT($H40),ISTEXT($E40),ISTEXT($F40)),(((COUNTIF($E40:$H40,Listes!$I$7)+COUNTIF($E40:$H40,Listes!$I$9)+COUNTIF($E40:$H40,Listes!$I$12))*$G$10)/4))+IF(OR(ISTEXT($F40),ISTEXT($E40)),\"0\",($F40-$E40)*24)+IF(OR(ISTEXT($H40),ISTEXT($G40)),\"0\",($H40-$G40)*24))","v":""},{"$f":"_xlfn.IFS(OR(I40=\"\",I40=\"Compléter G9\"),\"0,00\",I40>=$G$10,I40-$G$10,I40<$G$10,\"\")","v":"0,00"}]
{"$rows_left_out":13}
{"sheet":"Synthèse annuelle heures","index":1,"n_rows":5,"n_cols":9,"rows_kept":5,"cut":false,"hidden":false,"merged":[[0,2,2,7]]}
[null,null,"Récapitulatif des heures de travail"]
[]
[]
[]
["Année","Mois","Entreprise","Employé","Total heures effectuées par employé","Heures dues par mois","Heures dues par employé","Heure dues par entreprise","Reste à effectuer"]

{"sheet":"Listes","index":2,"n_rows":853,"n_cols":10,"rows_kept":853,"cut":false,"hidden":true,"merged":[[5,5,5,6],[0,3,3,8]]}
[null,null,null,"Listes "]
[]
[]
[]
[]
[null,"Années",null,"Mois",null,"Jours fériés",null,null,"heure matin","heure après-midi"]
[null,2022,null,"Janvier",null,"Jour de l'an",{"$f":"DATE('Calcul heures travail'!$B$7,1,1)","v":"1900-01-01"},null,"ABSENCE AUTORISEE","ABSENCE AUTORISEE"]
[null,{"$f":"B7+1","v":2023},null,"Février",null,"Lundi de Pâques",{"$f":"IF('Calcul heures travail'!B7=\"\",\"Entrer année\",(FLOOR(DAY(MINUTE('Calcul heures travail'!$B$7/38)/2+56)&\"/5/\"&'Calcul heures travail'!$B$7,7)-34)+1)","v":"Entrer année"},null,"ABSENCE NON AUTORISEE","ABSENCE NON AUTORISEE"]
[null,{"$f":"B8+1","v":2024},null,"Mars",null,"Fête du travail",{"$f":"DATE('Calcul heures travail'!$B$7,5,1)","v":"1900-05-01"},null,"CONGE PAYE","CONGE PAYE"]
[null,2025,null,"Avril",null,"Victoire de 1945",{"$f":"DATE('Calcul heures travail'!$B$7,5,8)","v":"1900-05-08"},null,"MALADIE","MALADIE"]
[null,2026,null,"Mai",null,"Ascension",{"$f":"IF($G$8=\"Entrer année\",\"Entrer année\",(FLOOR(DAY(MINUTE('Calcul heures travail'!$B$7/38)/2+56)&\"/5/\"&'Calcul heures travail'!$B$7,7)-34)+39)","v":"Entrer année"},null,"SANS SOLDE","SANS SOLDE"]
[null,2027,null,"Juin",null,"Lundi de Pentecôte",{"$f":"IF($G$8=\"Entrer année\",\"Entrer année\",(FLOOR(DAY(MINUTE('Calcul heures travail'!$B$7/38)/2+56)&\"/5/\"&'Calcul heures travail'!$B$7,7)-34)+50)","v":"Entrer année"},null,"RTT","RTT"]
[null,2028,null,"Juillet",null,"Fête nationale",{"$f":"DATE('Calcul heures travail'!$B$7,7,14)","v":"1900-07-14"},null,0,0.5]
[null,2029,null,"Août",null,"Assomption",{"$f":"DATE('Calcul heures travail'!$B$7,8,15)","v":"1900-08-15"},null,{"$f":"I13+1/1440","v":6.9444444444444447E-4},{"$f":"J13+1/1440","v":0.50069444444444444}]
[null,2030,null,"Septembre",null,"Toussaint",{"$f":"DATE('Calcul heures travail'!$B$7,11,1)","v":"1900-11-01"},null,{"$f":"I14+1/1440","v":1.3888888888888889E-3},0.50138888888888888]
[null,2031,null,"Octobre",null,"Armistice",{"$f":"DATE('Calcul heures travail'!$B$7,11,11)","v":"1900-11-11"},null,{"$f":"I15+1/1440","v":2.0833333333333333E-3},0.50208333333333333]
[null,2032,null,"Novembre",null,"Nöel",{"$f":"DATE('Calcul heures travail'!$B$7,12,25)","v":"1900-12-25"},null,2.7777777777777779E-3,0.50277777777777777]
[null,2033,null,"Décembre",null,null,null,null,3.4722222222222225E-3,0.50347222222222221]
[null,2034,null,null,null,null,null,null,4.1666666666666666E-3,0.50416666666666665]
[null,2035,null,null,null,null,null,null,4.8611111111111112E-3,0.50486111111111109]
[null,2036,null,null,null,null,null,null,5.5555555555555558E-3,0.50555555555555554]
[null,2037,null,null,null,null,null,null,6.2500000000000003E-3,0.50624999999999998]
[null,2038,null,null,null,null,null,null,6.9444444444444449E-3,0.50694444444444442]
[null,2039,null,null,null,null,null,null,7.6388888888888895E-3,0.50763888888888886]
[null,2040,null,null,null,null,null,null,8.3333333333333332E-3,0.5083333333333333]
[null,2041,null,null,null,null,null,null,9.0277777777777769E-3,0.50902777777777775]
[null,2042,null,null,null,null,null,null,9.7222222222222206E-3,0.50972222222222219]
[null,2043,null,null,null,null,null,null,1.0416666666666664E-2,0.51041666666666663]
[null,{"$f":"B28+1","v":2044},null,null,null,null,null,null,1.1111111111111108E-2,0.51111111111111107]
[null,2045,null,null,null,null,null,null,1.1805555555555552E-2,0.51180555555555551]
[null,2046,null,null,null,null,null,null,1.2499999999999995E-2,0.51249999999999996]
[null,2047,null,null,null,null,null,null,1.3194444444444439E-2,0.5131944444444444]
[null,2048,null,null,null,null,null,null,1.3888888888888883E-2,0.51388888888888884]
[null,2049,null,null,null,null,null,null,1.4583333333333327E-2,0.51458333333333328]
[null,2050,null,null,null,null,null,null,1.527777777777777E-2,0.51527777777777772]
[null,2051,null,null,null,null,null,null,1.5972222222222214E-2,0.51597222222222217]
[null,2052,null,null,null,null,null,null,1.6666666666666659E-2,0.51666666666666661]
[null,{"$f":"B37+1","v":2053},null,null,null,null,null,null,1.7361111111111105E-2,0.51736111111111105]
[null,2054,null,null,null,null,null,null,1.805555555555555E-2,0.51805555555555549]
[null,2055,null,null,null,null,null,null,1.8749999999999996E-2,0.51874999999999993]
{"$rows_left_out":814}
{"sheet":"Instructions","index":3,"n_rows":17,"n_cols":4,"rows_kept":17,"cut":false,"hidden":false,"merged":[[0,2,2,9],[8,3,8,7],[9,3,9,7],[10,3,10,7],[11,3,11,7],[16,3,16,7],[12,3,12,7],[13,3,13,7],[14,3,14,7],[15,3,15,7]]}
[null,null,"Calcul heures de travail - Instructions"]
[]
[]
[]
[null,"La saisie de donnée se fait dans l'onglet \"Calcul heures travail\""]
[null,"L'onglet \"Synthèse annuelle heures\" est une synthèse globale des heures de travail de tous les employés durant l'année"]
[null,"Un onglet masqué \"Liste\" est disponible pour mettre à jour les listes déroulantes (si besoin)"]
[]
[null,null,"Etape","Description"]
[null,null,1,"Renseigner le nom de l'entreprise"]
[null,null,2,"Renseigner le nom de l'employé"]
[null,null,3,"Renseigner l'année et le mois souhaité. Les numéros de semaine, les jours de la semaine, les jours fériés et week-end s'affichent automatiquement"]
[null,null,4,"Renseigner le nombre d'heures que l'employé doit effectuer par semaine (Heures dues par semaine) et le nombre de jours que l'employé doit travailler par semaine"]
[null,null,5,"Les nombres d'heures que l'employé doit effectuer par jour et par mois se calculent automatiquement"]
[null,null,6,"Compléter les heures d'arrivée et de d'épart de l'employée ou son type d'absence à l'aide de la liste déroulante"]
[null,null,7,"Lorsque vous avez terminée la saisie des données, cliquer sur le bouton \"ENREGISTRER ET REINITIALISER\" (en haut à droite) puis sur \"Oui\". La synthèse des heures est enregistrée dans l'onglet \"Synthèse annuelle heures\". "]
[null,null,8,"Si vous souhaitez apporter une dernière modification après avoir cliquer sur le bouton \"ENREGISTRER ET REINITIALISER\", cliquer sur \"Non\" puis sur \"OK\" dans la fenêtre qui apparaîtra"]